{"text_format":"1","workbook":"xlsx","n_sheets":12,"sheets":["Uvod","vyberKce","Vstupy","Ochrana","N_Zat","N_Vyp","N_Vys","S_Zat","S_Vyp","S_Vys","Dat","ZatData"],"not_rendered":{"charts":0,"images":8,"macros":1,"external_links":0,"defined_names":134,"comments":0,"pivot_tables":0},"unopened":[],"bounds":{"document_bytes":16777216,"sheet_cells":100000,"rows_first":2000,"rows_last":500,"rows_between":2000,"halvings":0,"cell_chars":16384,"cell_head_chars":4096},"cells_cut":0,"cells_raw":0,"read":"whole","date_system":"1900"}

{"sheet":"Uvod","index":0,"n_rows":26,"n_cols":7,"rows_kept":26,"cut":false,"hidden":false,"merged":[[19,0,20,10],[1,0,1,10],[0,0,0,10],[2,0,2,10],[3,0,3,10],[17,0,18,10]]}
["Výpočetní pomůcka pro výpočet"]
["Požární odolnosti dřevěného prvku"]
["s obdélníkovým průřezem"]
["dle ČSN EN 1995-1"]
[]
["Podporované konstrukce:"]
["•","horizontální jednopolový nosník spojitě zatížený (posuzuje se pouze ohyb, smyk není posuzován),"]
["•","horizontální dvoupolový nosník spojitě zatížený (posuzuje se pouze ohyb, smyk není posuzován),"]
["•","vertikální sloup bodově excentricky zatížený (posuzuje se kombinace M+N a stabilita)."]
[]
["Instrukce:",null,null,null,null,null,{"$f":"IF(F12=\"\",\"\",\"Gratuluji, úspěšně jste vyplnili vzorovou \")","v":""}]
["Vyplňujte pouze žlutě vyznačené buňky",null,null,null,null,null,{"$f":"IF(F12=\"\",\"\",\"buňku :) Přeji hodně štěstí při výpočtu :)\")","v":""}]
["Pro fungování musíte mít zapnuty a povoleny makra."]
["Pro ideální fungování používejte nejnovější verzi MS Excel (ověřeno pro MS Excel 2010, 2013, 2016, 2019)"]
["a Windows (ověřeno pro Windows 7, 8 a 10)."]
[]
["Doporučení:"]
["Při výběru materiálu konstrukce zkontrolujte, zda skutečné vlastnosti (zejména hustota) Vámi navrženého materiálu odpovídají tabulkovým hodnotám (zejména u lepeného dřeva)."]
[]
["Pro každý nový výpočet doporučuji znovu zapnout pomůcku (zejména pakliže jste při předchozím výpočtu zadávali vlastní materiálové charakteristiky)."]
[]
[]
["Autor:",null,"Jakub Holan"]
["Kontakt:",null,"jakub.holan@fsv.cvut.cz"]
["Verze 1.5",null,"(27.09.2020)"]
["Tato práce byla podpořena grantem Studentské grantové soutěže ČVUT č. SGS20/041/OHK1/1T/11."]

{"sheet":"vyberKce","index":1,"n_rows":1,"n_cols":1,"rows_kept":1,"cut":false,"hidden":true,"merged":[[0,0,0,11]]}
["Výběr konstrukce"]

{"sheet":"Vstupy","index":2,"n_rows":74,"n_cols":18,"rows_kept":74,"cut":false,"hidden":true,"merged":[[0,0,0,9],[31,5,31,8],[30,5,30,6],[24,0,27,8],[3,0,3,3],[14,2,14,3]]}
["Zadání vstupních hodnot"]
[]
["Materiál:"]
["2) Lepené lamelové dřevo",null,null,null,null,"Jehličnaté",null,"GL 32c"]
[null,null,null,null,null,"Jiné"]
[]
["Charakteristická hodnota pevnosti v ohybu",null,null,null,null,"Modul pružnosti"]
["fm,k = ",{"$f":"Dat!B76","v":32},"MPa",null,null,"E0.05 =",{"$f":"Dat!E76","v":11100},"MPa"]
[]
["Charakteristická hustota",null,null,null,null,"Charakteristická hodnota pevnosti v tlaku"]
["ρk = ",{"$f":"Dat!C76","v":410},"kg/m3",null,null,"fc,0,k =",{"$f":"Dat!D76","v":26.5},"MPa"]
[]
["Modifikační součinitel pevnosti pro třídy provozu a třídy trvání zatížení:"]
["Třída provozu",null,2]
["Třída trvání zatížení:",null,"3) Střednědobé"]
["kmod = ",null,{"$f":"HLOOKUP(C15,Dat!B19:F22,(C14+1))","v":0.8},"(1995-1-1","_3.1.3)"]
[null,null,null,null,null,{"$f":"Dat!D13","v":"Délka levého pole:"}]
[null,null,null,null,null,{"$f":"IF(typKce=2,\"L1 =\",\"\")","v":"L1 ="},4,{"$f":"IF(typKce=2,\"m\",\"\")","v":"m"}]
["Šířka a výška průřezu"]
["b",180,"mm",null,null,{"$f":"Dat!C13","v":"Délka pravého pole:"}]
["h",300,"mm",null,null,{"$f":"IF(typKce=2,\"L2 =\",IF(typKce=3,\"H =\",\"L\"))","v":"L2 ="},6,"m"]
[]
["Kombinační součinitel pro hlavní proměnné zatížení při požární situaci"]
["Volba součinitele:",null,"ψ2,1"]
["Volbu součinitele proveďte v souladu s normou - viz: ČSN EN 1991-1-2_NA.2.10: \"...v ČR se použije kvazistálá hodnota ψ2,1 Q1. Podle charakteru konstrukce budovy a jejího umístění se doporučuje, zejména u halových objektů, pro zatížení sněhem a větrem uplatnit použití časté hodnoty ψ1,1 Q1\""]
[]
[]
[]
[]
["Hrany vystavené požáru",null,null,null,null,"Ochrana povrchu"]
{"$rows_left_out":45}
{"sheet":"Ochrana","index":3,"n_rows":16,"n_cols":8,"rows_kept":16,"cut":false,"hidden":true,"merged":[[3,0,3,3],[8,0,8,4],[13,0,13,2],[0,0,0,8]]}
["Specifikace ochrany průřezu"]
[]
["Počátek zuhelnatění:"]
["1) Deska/y na bázi dřeva / dř. obložení",null,null,null,{"$f":"Dat!M31","v":""}]
[{"$f":"Dat!J31","v":"celková tl. vrstev:"},null,20,{"$f":"IF(Dat!I31=Dat!I37,\"min\",\"mm\")","v":"mm"},{"$f":"Dat!K31","v":0},null,10,"mm"]
["tch =",{"$f":"Dat!L31","v":20.951312035156967},"min"]
[]
["Čas porušení protipožárního obvodového pláště:"]
["1) Deska/y na bázi dřeva nebo dř. obložení"]
["tf =",{"$f":"IF(Dat!I41=Dat!I42,Dat!L31,IF(Dat!I41=Dat!I43,Dat!L31,\"\"))","v":20.951312035156967},"min","tf =",100,"min"]
["tf =",{"$f":"IF(Dat!I41=Dat!I42,Dat!L31,IF(Dat!I41=Dat!I43,Dat!L31,E10))","v":20.951312035156967},"min"]
[]
["Rychlost zuhelnatění po počátku zuhelnatění před porušením protipožárního pláště"]
["1) Jediná vrstva desky SDK F"]
[{"$f":"Dat!J47","v":"tloušťka vrstvy:"},null,22,{"$f":"IF(Dat!I52=Dat!I51,\"\",\"mm\")","v":"mm"}]
["k2 =",{"$f":"Dat!K52","v":0.60400000000000009}]

{"sheet":"N_Zat","index":4,"n_rows":25,"n_cols":10,"rows_kept":25,"cut":false,"hidden":true,"merged":[[0,0,0,9],[3,0,3,2],[16,2,16,3]]}
[{"$f":"CONCATENATE(Dat!G13,\" nosník - Zadání zatížení\")","v":"Dvoupolový nosník - Zadání zatížení"}]
[]
["Kategorie stavby:"]
["E - skladovací plochy",null,null,"ψ0 = ",{"$f":"VLOOKUP(A4,ZatData!A1:D8,2)","v":1},"ψ1 = ",{"$f":"VLOOKUP(A4,ZatData!A1:D8,3)","v":0.9},"ψ2 = ",{"$f":"VLOOKUP(A4,ZatData!A1:D8,4)","v":0.8}]
[]
["Základní kombinace zatížení pro návrhové situace (MSÚ -  STR/GEO)"]
[null,"6.10",{"$f":"IF(OR(Dat!F4=Dat!F2,Dat!F4=Dat!F3),\"(Vyberte méně příznivou variantu z 6.10a a 6.10b)\",\"\")","v":""}]
[]
["Velikost zatížení"]
[null,"Stálé zatížení",null,null,null,null,"gk [kN/m]","γG [-]","ξ","gd [kN/m]"]
[null,"Vlastní tíha       g0",null,null,null,null,{"$f":"10*(Vstupy!B11*(Vstupy!B20*Vstupy!B21*10^(-6)))/1000","v":0.22140000000000001},{"$f":"1.35","v":1.35},{"$f":"Dat!G4","v":1},{"$f":"G11*H11*I11","v":0.29889000000000004}]
[null,"Ostatní stálé    g-g0",null,null,null,null,5,{"$f":"1.35","v":1.35},{"$f":"I11","v":1},{"$f":"G12*H12*I12","v":6.75}]
[null,null,null,null,null,null,{"$f":"SUM(G11:G12)","v":5.2214},null,null,{"$f":"SUM(J11:J12)","v":7.0488900000000001}]
[]
[null,"Proměnné zatížení",null,null,null,null,"qk [kN/m]","γQ","ψ","qd [kN/m]"]
["Q1","Užitné",null,null,null,null,2,1.5,{"$f":"IF(AND(OR($B$7=Dat!$F$3,$B$7=Dat!$F$1),$E$25=A16),1,$E$4)","v":1},{"$f":"G16*H16*I16","v":3}]
["Q2","Sníh","H < 1000 m n.m.",null,null,null,0,1.5,{"$f":"IF(AND(OR($B$7=Dat!$F$3,$B$7=Dat!$F$1),$E$25=A17),1,Dat!I4)","v":0.5},{"$f":"H17*G17*I17","v":0}]
["Q3","Vítr",null,null,null,null,0,1.5,{"$f":"IF(AND(OR($B$7=Dat!$F$3,$B$7=Dat!$F$1),$E$25=A18),1,0.6)","v":0.6},{"$f":"H18*G18*I18","v":0}]
["Q4","Proměnné 4",null,null,null,null,0,1.5,{"$f":"IF(AND(OR($B$7=Dat!$F$3,$B$7=Dat!$F$1),$E$25=A19),1,$E$4)","v":1},{"$f":"H19*G19*I19","v":0}]
[]
[null,null,null,null,null,null,{"$f":"SUM(G16:G20)","v":2},null,null,{"$f":"SUM(J16:J20)","v":3}]
[]
["Celkem",null,null,null,null,null,null,null,null,{"$f":"J21+J13","v":10.04889}]
[]
["Hlavní proměnné zatížení:",null,null,null,"Q1",{"$f":"VLOOKUP(E25,A16:G19,7)","v":2},"kN/m'"]

{"sheet":"N_Vyp","index":5,"n_rows":107,"n_cols":7,"rows_kept":107,"cut":false,"hidden":true,"merged":[[101,2,101,4],[0,0,0,8],[48,0,48,8],[2,0,2,8],[20,0,20,4],[24,0,24,8],[71,0,71,8],[100,1,100,3]]}
[{"$f":"CONCATENATE(\"Výpočet požární odolnosti \",Dat!H13,\" nosníku\")","v":"Výpočet požární odolnosti dvoupolového nosníku"}]
[]
["Ověření únosnosti při pokojové teplotě"]
[]
["Liniové zatížení na nosníku",null,null,null,{"$f":"Dat!F13","v":"Moment nad střední podporou"}]
["f = ",{"$f":"N_Zat!J23","v":10.04889},"kN/m'",null,"MEd = ",{"$f":"Dat!E13","v":35.171115},"kNm"]
[]
["Průřezový modul průřezu"]
["W",{"$f":"10^(-9)*(1/6)*Vstupy!B20*Vstupy!B21^2","v":2.6999999999999997E-3},"m3"]
[]
["Dílčí součinitel pro vlastnosti materiálu v základní kombinaci"]
["γM = ",{"$f":"VLOOKUP(Vstupy!A4,Dat!A3:B4,2)","v":1.25},"(1995-1-1_2.4.1)"]
[]
["Návrhová hodnota pevnosti"]
["fm,d =",{"$f":"Vstupy!C16*Vstupy!B8/B12","v":20.48},"MPa","(1995-1-1_2.4.1 (1))"]
[]
["Součinitel redukce pevnosti v ohybu v důsledku příčné a torzní nestability"]
["kcrit =",{"$f":"IF(Vstupy!D41=Dat!Q5,1,IF(Vstupy!D41=Dat!Q6,Dat!R47,\"Chyba\"))","v":1},"(1995-1-1_6.3.3 (5))"]
[]
["Ověření zda navržený průřez vyhoví na ohyb"]
["            σm,d < kcrit * fm,d",null,null,null,null,"(1995-1-1_6.3.3 (3))"]
[{"$f":"0.001*F6/B9","v":13.02633888888889},"MPa",{"$f":"IF(A22<D22,\"<\",\">\")","v":"<"},{"$f":"B18*B15","v":20.48},"MPa"]
[null,null,{"$f":"IF(C22=\"<\",\"Vyhovuje\",\"NEVYHOVUJE\")","v":"Vyhovuje"}]
[]
["Účinek požáru - Výpočet velikosti ohybového momentu"]
[]
["Charakteristická hodnota stálého zatížení"]
["Gk = ",{"$f":"N_Zat!G13","v":5.2214},"kN/m'"]
[]
["Dílčí součinitel pro stálá zatížení"]
{"$rows_left_out":78}
{"sheet":"N_Vys","index":6,"n_rows":6,"n_cols":4,"rows_kept":6,"cut":false,"hidden":true,"merged":[[0,0,0,8]]}
[{"$f":"CONCATENATE(\"Výsledek - Požární odolnost \",Dat!H13,\" nosníku\")","v":"Výsledek - Požární odolnost dvoupolového nosníku"}]
[]
[{"$f":"CONCATENATE(Dat!G13,\" nosník o průřezu \",Vstupy!B20, \" x \",Vstupy!B21,\" mm (b x h) při zadaných vlastnostech a zadaném\")","v":"Dvoupolový nosník o průřezu 180 x 300 mm (b x h) při zadaných vlastnostech a zadaném"}]
[{"$f":"CONCATENATE(\"zatížení vydrží vzdorovat normovému požáru \",ROUND(tpozar,1),\" minut, aniž by došlo ke kolapsu konstrukce.\")","v":"zatížení vydrží vzdorovat normovému požáru 64.5 minut, aniž by došlo ke kolapsu konstrukce."}]
[]
["Požární odolnost je tedy",null,null,{"$f":"CONCATENATE((IF(tpozar<150,\"R \",\"větší než R \")),N_Vyp!C107,\".\")","v":"R 60."}]

{"sheet":"S_Zat","index":7,"n_rows":31,"n_cols":10,"rows_kept":31,"cut":false,"hidden":true,"merged":[[0,0,0,9],[3,0,3,2],[16,2,16,3],[27,3,27,4],[30,3,30,4]]}
["Sloup - Zadání zatížení"]
[]
["Kategorie stavby:"]
["H - střechy",null,null,"ψ0 = ",{"$f":"VLOOKUP(A4,ZatData!A1:D8,2)","v":0},"ψ1 = ",{"$f":"VLOOKUP(A4,ZatData!A1:D8,3)","v":0},"ψ2 = ",{"$f":"VLOOKUP(A4,ZatData!A1:D8,4)","v":0}]
[]
["Základní kombinace zatížení pro návrhové situace (MSÚ -  STR/GEO)"]
[null,"6.10",{"$f":"IF(OR(Dat!F4=Dat!F2,Dat!F4=Dat!F3),\"(Vyberte méně příznivou variantu z 6.10a a 6.10b)\",\"\")","v":""}]
[]
["Velikost zatížení"]
[null,"Stálé zatížení",null,null,null,null,"Gk [kN]","γG [-]","ξ","Gd [kN]"]
[null,"Vlastní tíha       g0",null,null,null,null,{"$f":"10*(Vstupy!B11*(Vstupy!B20*Vstupy!B21*10^(-6)))/1000","v":0.22140000000000001},{"$f":"1.35","v":1.35},{"$f":"Dat!G4","v":1},{"$f":"G11*H11*I11","v":0.29889000000000004}]
[null,"Ostatní stálé    g-g0",null,null,null,null,50,{"$f":"1.35","v":1.35},{"$f":"I11","v":1},{"$f":"G12*H12*I12","v":67.5}]
[null,null,null,null,null,null,{"$f":"SUM(G11:G12)","v":50.221400000000003},null,null,{"$f":"SUM(J11:J12)","v":67.79889}]
[]
[null,"Proměnné zatížení",null,null,null,null,"Qk [kN]","γQ","ψ","Qd [kN]"]
["Q1","Užitné",null,null,null,null,25,1.5,{"$f":"IF(AND(OR($B$7=Dat!$F$3,$B$7=Dat!$F$1),$E$25=A16),1,$E$4)","v":1},{"$f":"G16*H16*I16","v":37.5}]
["Q2","Sníh","H < 1000 m n.m.",null,null,null,10,1.5,{"$f":"IF(AND(OR($B$7=Dat!$F$3,$B$7=Dat!$F$1),$E$25=A17),1,Dat!I4)","v":0.5},{"$f":"H17*G17*I17","v":7.5}]
["Q3","Vítr",null,null,null,null,0,1.5,{"$f":"IF(AND(OR($B$7=Dat!$F$3,$B$7=Dat!$F$1),$E$25=A18),1,0.6)","v":0.6},{"$f":"H18*G18*I18","v":0}]
["Q4","Proměnné 4",null,null,null,null,0,1.5,{"$f":"IF(AND(OR($B$7=Dat!$F$3,$B$7=Dat!$F$1),$E$25=A19),1,$E$4)","v":0},{"$f":"H19*G19*I19","v":0}]
[]
[null,null,null,null,null,null,{"$f":"SUM(G16:G20)","v":35},null,null,{"$f":"SUM(J16:J20)","v":45}]
[]
["Celkem",null,null,null,null,null,null,null,null,{"$f":"J21+J13","v":112.79889}]
[]
["Hlavní proměnné zatížení:",null,null,null,"Q1",{"$f":"VLOOKUP(E25,A16:G19,7)","v":25},"kN"]
[]
["Excentricita působícího zatížení ve směru y:",null,null,null,null,"ey =",{"$f":"Vstupy!B20/5","v":36},"mm"]
[null,null,null,"→ Moment ",null,"Mz,d =",{"$f":"J23*G27/1000","v":4.0607600399999999},"kNm"]
[]
["Excentricita působícího zatížení ve směru z:",null,null,null,null,"ez =",{"$f":"Vstupy!B21/3","v":100},"mm"]
{"$rows_left_out":2}
{"sheet":"S_Vyp","index":8,"n_rows":166,"n_cols":15,"rows_kept":166,"cut":false,"hidden":true,"merged":[[0,0,0,8],[2,0,2,8],[29,13,29,17],[50,0,50,8],[76,0,76,8],[152,4,153,6],[156,4,157,6],[129,11,129,15],[130,11,130,15],[42,3,43,5],[46,3,47,5],[98,0,98,8],[146,10,146,11]]}
["Výpočet požární odolnosti sloupu"]
[]
["Ověření únosnosti při pokojové teplotě"]
[]
["Šířka a výška průřezu"]
["b",{"$f":"Vstupy!B20","v":180},"mm"]
["h",{"$f":"Vstupy!B21","v":300},"mm"]
[]
["Velikost osové síly",null,null,"Plocha průřezu",null,null,"Návrhové napětí v tlaku"]
["NEd",{"$f":"S_Zat!J23","v":112.79889},"kN","A",{"$f":"Vstupy!B20*Vstupy!B21/10^6","v":5.3999999999999999E-2},"m2","σc,0,d",{"$f":"0.001*B10/E10","v":2.0888683333333335},"MPa"]
[]
["Velikosti momentů",null,null,"Průřezové moduly",null,null,"Návrhová napětí v ohybu"]
["My,Ed",{"$f":"S_Zat!G31","v":11.279888999999999},"kNm","Wy",{"$f":"(B6*B7^2/6)/10^9","v":2.7000000000000001E-3},"m3","σm,y,d",{"$f":"0.001*B13/E13","v":4.1777366666666662},"MPa"]
["Mz,Ed",{"$f":"S_Zat!G28","v":4.0607600399999999},"kNm","Wz",{"$f":"(B7*B6^2/6)/10^9","v":1.6199999999999999E-3},"m3","σm,z,d",{"$f":"0.001*B14/E14","v":2.5066420000000003},"MPa"]
[]
["Dílčí součinitel pro vlastnosti materiálu v základní kombinaci"]
["γM = ",{"$f":"VLOOKUP(Vstupy!A4,Dat!A3:B4,2)","v":1.25},null,"(1995-1-1_2.4.1)"]
[]
["Návrhová hodnota pevnosti v tlaku rovnoběžně s vlákny"]
["fc,0,d =",{"$f":"Vstupy!C16*Vstupy!G11/B17","v":16.96},"MPa","(1995-1-1_2.4.1 (1))"]
[]
["Návrhová hodnota pevnosti v ohybu"]
["fm,d =",{"$f":"Vstupy!C16*Vstupy!B8/B17","v":20.48},"MPa","(1995-1-1_2.4.1 (1))"]
[]
["Součinitel redistribuce napětí a vlivu nehomogenity materiálu v průřezu"]
["km =",0.7,"(obdélník)","(1995-1-1_6.1.6 (2))"]
[]
["Poměrné štíhlostní poměry",null,null,null,null,"Součinitele vzpěrnosti"]
["λrel,y =",{"$f":"Dat!AH17","v":0.53876850231194306},"(1995-1-1_6.3.2 (1))",null,null,"kc,y =",{"$f":"Dat!AF27","v":0.96786142276154608},"(1995-1-1_6.3.2 (3))"]
["λrel,z =",{"$f":"Dat!AH18","v":0.8979475038532384},"(1995-1-1_6.3.2 (1))",null,null,"kc,z =",{"$f":"Dat!AF28","v":0.84275758225086939},"(1995-1-1_6.3.2 (3))"]
{"$rows_left_out":137}
{"sheet":"S_Vys","index":9,"n_rows":6,"n_cols":4,"rows_kept":6,"cut":false,"hidden":true,"merged":[[0,0,0,8]]}
["Výsledek - Požární odolnost sloupu"]
[]
[{"$f":"CONCATENATE(\"Sloup o průřezu \",Vstupy!B20, \" x \",Vstupy!B21,\" mm (b x h) při zadaných vlastnostech a zadaném zatížení vydrží\")","v":"Sloup o průřezu 180 x 300 mm (b x h) při zadaných vlastnostech a zadaném zatížení vydrží"}]
[{"$f":"CONCATENATE(\"vzdorovat normovému požáru \",ROUND(tpozarSl,1),\" minut, aniž by došlo ke kolapsu konstrukce.\")","v":"vzdorovat normovému požáru 72 minut, aniž by došlo ke kolapsu konstrukce."}]
[]
["Požární odolnost je tedy",null,null,{"$f":"CONCATENATE((IF(tpozarSl<150,\"R \",\"větší než R \")),S_Vyp!C166,\".\")","v":"R 60."}]

{"sheet":"Dat","index":10,"n_rows":88,"n_cols":35,"rows_kept":88,"cut":false,"hidden":true,"merged":[[0,0,0,1],[0,2,0,3],[1,2,1,3],[1,0,1,1],[8,0,8,1],[2,16,2,24],[2,26,2,34],[48,16,48,24],[29,26,29,34],[82,0,82,2],[26,7,26,12],[77,0,77,2],[19,9,19,12],[20,9,20,12],[53,8,53,13],[70,12,70,15]]}
["Materiálový součinitel",null,"Převod na 20% kvantil",null,null,"6.10",1,null,null,null,null,"ψ1","ψ2","Zvolené ψ"]
["Tabulka 2.3 (1995-1-1_2.4.1)",null,"Tabulka 2.1 (1995-1-2_2.3 (3))",null,null,"6.10a",1,"H < 1000 m n.m.",0.5,null,"Nosník",{"$f":"N_Zat!G4","v":0.9},{"$f":"N_Zat!I4","v":0.8},{"$f":"IF(Vstupy!C24=Dat!C25,Dat!L2,Dat!M2)","v":0.8}]
["1) Rostlé dřevo",1.3,1.25,"Rostlé dřevo",null,"6.10b",0.85,"H > 1000 m n.m.",0.7,null,"Sloup",{"$f":"S_Zat!G4","v":0},{"$f":"S_Zat!I4","v":0},{"$f":"IF(Vstupy!C24=Dat!C25,Dat!L3,Dat!M3)","v":0},null,null,"Nosník - kcrit za běžné teploty",null,null,null,null,null,null,null,null,null,"Sloup - kc,y & kc,z za běžné teploty"]
["2) Lepené lamelové dřevo",1.25,1.1499999999999999,"LLD",null,{"$f":"I13","v":"6.10"},{"$f":"VLOOKUP(F4,F1:G3,2)","v":1},{"$f":"J13","v":"H < 1000 m n.m."},{"$f":"VLOOKUP(H4,H2:I3,2)","v":0.5},null,null,null,null,null,null,null,"Součinitel redukce pevnosti v ohybu v důsledku příčné a torzní nestability",null,null,null,null,null,null,null,null,null,"Sloup je zajištěn proti vybočení jinde než v podporách:",null,null,null,null,null,{"$f":"Vstupy!D41","v":"ANO"}]
[{"$f":"Vstupy!A4","v":"2) Lepené lamelové dřevo"},null,null,null,null,null,null,null,null,null,null,null,null,null,null,null,"ANO",null,null,null,null,null,null,null,null,null,"Lcr,uživ =",{"$f":"Vstupy!D42","v":3},"m"]
[null,null,null,null,null,null,null,null,null,null,null,null,null,null,null,null,"NE",null,null,null,null,null,null,null,null,null,"H =",{"$f":"Vstupy!G21","v":6},"m"]
[null,null,null,null,null,null,null,null,null,null,null,null,null,null,null,null,{"$f":"Vstupy!D41","v":"ANO"},"žlutá?",null,null,null,null,null,null,null,null,"Lef =",{"$f":"IF(AG4=Q5,AB5,AB6)","v":3},"m"]
[null,null,null,null,null,null,null,null,null,null,null,null,null,null,null,null,{"$f":"IF(Q7=Q5,1,0)","v":1},{"$f":"IF(AND(Q8=0,D29=0),1,0)","v":0}]
["Konstrukce",null,null,null,null,null,null,null,null,null,null,null,null,null,null,null,"1) Stanovení účinné délky",null,null,null,null,null,null,null,null,null,"1) Geometrie"]
["Nosník 1 pole",1,"Délka nosníku:",{"$f":"\"\"","v":""},{"$f":"B81","v":45.220005},"Moment v polovině rozpětí","Jednopolový","jednopolového",{"$f":"N_Zat!B7","v":"6.10"},{"$f":"N_Zat!C17","v":"H < 1000 m n.m."},"Zajištění proti vybočení a zabránění torznímu natočení","Tlačený okraj nosníku je po celé délce zajištěn proti vybočení a je zabráněno torznímu","natočení v podpěrách:",null,null,null,"(dle ČSN EN 1995-1-1_6.3.3 Nosníky vystavené kombinaci ohybu a tlaku)",null,null,null,null,null,null,null,null,null,"b",{"$f":"Vstupy!B20/1000","v":0.18},"m",null,"A",{"$f":"AB10*AB11","v":5.3999999999999999E-2},"m2"]
["Nosník 2 pole",2,"Délka pravého pole:","Délka levého pole:",{"$f":"ABS(B88)","v":35.171115},"Moment nad střední podporou","Dvoupolový","dvoupolového",{"$f":"I10","v":"6.10"},{"$f":"J10","v":"H < 1000 m n.m."},"Zajištění proti vybočení a zabránění torznímu natočení","Tlačený okraj nosníku je po celé délce zajištěn proti vybočení a je zabráněno torznímu","natočení v podpěrách:",null,null,null,null,null,null,null,null,null,null,null,null,null,"h",{"$f":"Vstupy!B21/1000","v":0.3},"m"]
["Sloup",3,"Výška sloupu:",{"$f":"\"\"","v":""},null,null,null,null,{"$f":"S_Zat!B7","v":"6.10"},{"$f":"S_Zat!C17","v":"H < 1000 m n.m."},"Zajištění proti vybočení","Sloup je zajištěn proti vybočení jinde než v podporách:",{"$f":"\"\"","v":""},null,null,null,"Rozpětí",null,null,null,"Zatížení působí na tlačeném okraji nosníku"]
[null,2,{"$f":"VLOOKUP(typKce,B10:C12,2)","v":"Délka pravého pole:"},{"$f":"VLOOKUP(typKce,B10:D12,3)","v":"Délka levého pole:"},{"$f":"VLOOKUP(typKce,B10:E12,4)","v":35.171115},{"$f":"VLOOKUP(typKce,B10:F12,5)","v":"Moment nad střední podporou"},{"$f":"VLOOKUP(typKce,B10:G12,6)","v":"Dvoupolový"},{"$f":"VLOOKUP(typKce,B10:H12,7)","v":"dvoupolového"},{"$f":"VLOOKUP(typKce,B10:I12,8)","v":"6.10"},{"$f":"VLOOKUP(typKce,B10:J12,9)","v":"H < 1000 m n.m."},{"$f":"VLOOKUP(typKce,B10:K12,10)","v":"Zajištění proti vybočení a zabránění torznímu natočení"},{"$f":"VLOOKUP(typKce,B10:L12,11)","v":"Tlačený okraj nosníku je po celé délce zajištěn proti vybočení a je zabráněno torznímu"},{"$f":"VLOOKUP(typKce,B10:M12,12)","v":"natočení v podpěrách:"},null,null,null,"l",{"$f":"Vstupy!G21","v":6},"m",null,null,"ANO",null,null,null,null,"2) Štíhlostní poměry"]
[null,null,null,null,null,null,null,null,null,null,null,null,null,null,null,null,null,null,null,null,null,null,null,null,null,null,"Iy",{"$f":"AB10*AB11^3/12","v":4.0499999999999998E-4},"m4","iy",{"$f":"SQRT(AB14/$AF$10)","v":8.6602540378443865E-2},"m","λy",{"$f":"$AB$7/AE14","v":34.641016151377549}]
[null,null,null,null,null,null,null,null,null,null,null,null,null,null,null,null,"Poměr mezi účinnou délkou a rozpětím (pro prostě podepřený, spojité zatížení)",null,null,null,null,null,null,null,null,null,"Iz",{"$f":"AB11*AB10^3/12","v":1.4579999999999999E-4},"m4","iz",{"$f":"SQRT(AB15/$AF$10)","v":5.1961524227066319E-2},"m","λz",{"$f":"$AB$7/AE15","v":57.735026918962575}]
[null,null,null,null,null,null,null,null,null,null,null,null,null,null,null,null,"lef/l",0.9,"(tab 6.1)"]
["Modifikační součinitel pevnosti pro třídy provozu a třídy trvání zatížení:",null,null,null,null,null,null,null,null,null,null,null,null,null,null,null,null,null,null,null,null,null,null,null,null,null,"Poměrný štíhlostní poměr odpovídající ohybu kolem osy y",null,null,null,null,null,"λrel,y",{"$f":"(AH14/PI())*SQRT(Vstupy!G11/Vstupy!G8)","v":0.53876850231194306},"(6.21)"]
["Klasický materiál?",null,{"$f":"IF(OR(A5=A3,A5=A4),1,0)","v":1},null,null,null,null,null,null,null,null,null,null,null,null,null,"Účinná délka nosníku závislá na podmínkách uložení a uspořádání",null,null,null,null,null,null,null,null,null,"Poměrný štíhlostní poměr odpovídající ohybu kolem osy z",null,null,null,null,null,"λrel,z",{"$f":"(AH15/PI())*SQRT(Vstupy!G11/Vstupy!G8)","v":0.8979475038532384},"(6.22)"]
[null,"1) Stálé","2) Dlouhodobé","3) Střednědobé","4) Krátkodobé","5) Okamžité",null,null,null,null,null,null,null,null,null,null,"lef",{"$f":"R16*R13+2*Vstupy!B21*0.001","v":6},"m"]
[1,0.6,0.7,0.8,0.9,1.1000000000000001,null,null,null,"Vystavené hrany:",null,null,null,null,null,null,null,null,null,null,null,null,null,null,null,null,"2) Stanovení součinitelů vzpěrnosti"]
[2,0.6,0.7,0.8,0.9,1.1000000000000001,null,null,null,"(Pozn.: vystavená šířka -> zmenšuje se výška!)",null,null,null,null,null,null,"2) Stanovení součinitele vzpěrnosti",null,null,null,null,null,null,null,null,null,"(dle ČSN EN 1995-1-1_6.3.2 Sloupy vystavené kombinaci ohybu a tlaku)"]
[3,0.5,{"$f":"0.55","v":0.55000000000000004},0.65,0.7,0.9,null,null,null,"1 x šířka","2 x šířka",{"$f":"Vstupy!A31","v":"1 x šířka"},{"$f":"IF(AND(L23=1,L25=1),1,0)","v":0},null,null,null,"(dle ČSN EN 1995-1-1_6.3.2 Sloupy vystavené kombinaci ohybu a tlaku)"]
[null,null,null,null,null,null,{"$f":"HLOOKUP(Vstupy!C15,B19:F22,(Vstupy!C14+1))","v":0.8},null,null,1,2,{"$f":"HLOOKUP(L22,J22:K23,2)","v":1},{"$f":"IF(AND(L23=1,L25=2),1,0)","v":1},null,null,null,null,null,null,null,null,null,null,null,null,null,"Součinitel přímosti:"]
[null,null,null,null,null,null,null,null,null,"1 x výška","2 x výška",{"$f":"Vstupy!A32","v":"2 x výška"},{"$f":"IF(AND(L23=2,L25=1),1,0)","v":0},null,null,null,"Poloměr setrvačnosti průřezu k ose z",null,null,null,"Štíhlostní poměr",null,null,null,null,null,"βc =",{"$f":"IF(A5=A3,0.2,0.1)","v":0.1},null,"(6.29)"]
["Chráněný",null,"ψ1,1",null,null,null,null,null,null,1,2,{"$f":"HLOOKUP(L24,J24:K25,2)","v":2},{"$f":"IF(AND(L23=2,L25=2),1,0)","v":0},null,null,null,"iz",{"$f":"SQRT((1/12)*Vstupy!B21*Vstupy!B20^3/(Vstupy!B20*Vstupy!B21))","v":51.96152422706632},"mm",null,"λz",{"$f":"1000*R19/R25","v":115.47005383792515}]
["Nechráněný",null,"ψ2,1",null,null,null,null,null,null,null,null,null,null,null,null,null,null,null,null,null,null,null,null,null,null,null,"Součinitele vzpěrnosti"]
[null,null,null,null,null,null,null,"Ochrana:",null,null,null,null,null,null,null,null,"Poměrný štíhlostní poměr odpovídající ohybu kolem osy z",null,null,null,null,null,null,null,null,null,"ky =",{"$f":"0.5*(1+AB24*(AH17-0.3)+AH17^2)","v":0.65707417465732432},"(6.26)",null,"kc,y =",{"$f":"1/(AB27+SQRT(AB27^2-AH17^2))","v":0.96786142276154608},"(6.27)"]
["Jehličnaté",null,null,null,null,null,null,null,null,null,null,null,null,null,null,null,"λrel,z",{"$f":"(V25/PI())*SQRT(Vstupy!G11/Vstupy!G8)","v":1.7958950077064768},null,"(6.22)",null,null,null,null,null,null,"kz =",{"$f":"0.5*(1+AB24*(AH18-0.3)+AH18^2)","v":0.93305223503079271},"(6.26)",null,"kc,z =",{"$f":"1/(AB28+SQRT(AB28^2-AH18^2))","v":0.84275758225086939},"(6.28)"]
["Listnaté",null,"Známe fm,k a ρk?",{"$f":"IF(AND(A5=A3,A31=A28),F45,IF(AND(A5=A3,A31=A29),F57,IF(A5=A4,F72,0)))","v":1},null,null,null,null,"Počátek zuhelnatění:"]
[null,null,"Je vybrán materiál:",{"$f":"IF(AND(A5=A3,A31=A28),1,IF(AND(A5=A3,A31=A29),2,3))","v":3},null,null,null,null,null,{"$f":"Ochrana!C5","v":20},{"$f":"Ochrana!G5","v":10},"tch",null,null,null,null,"Součinitel přímosti:",null,null,null,null,null,null,null,null,null,"Sloup - kc,y & kc,z za požáru"]
{"$rows_left_out":59}
{"sheet":"ZatData","index":11,"n_rows":8,"n_cols":4,"rows_kept":8,"cut":false,"hidden":true,"merged":[]}
["A - obytné plochy",0.7,0.5,0.3]
["B - kancelářské plochy",0.7,0.5,0.3]
["C - shromažďovací plochy",0.7,0.7,0.6]
["D - obchodní plochy",0.7,0.7,0.6]
["E - skladovací plochy",1,0.9,0.8]
["F - dopravní plochy (tíha vozidla < 30 kN)",0.7,0.7,0.6]
["G - dopravní plochy (30 kN < tíha vozidla < 160kN)",0.7,0.5,0.3]
["H - střechy",0,0,0]